BDBM256867 US10654855, Example 60::US11236095, Example 60::US9492453, 60
SMILES NC1(CCN(CC1)c1ncnc2[nH]ccc12)C(=O)NC(Cn1cccn1)c1ccc(Cl)cc1
InChI Key
Data  3 IC50
  Tab Delimited (TSV)   2D SDfile   Computed 3D by Vconf -m prep SDfile
Find this compound or compounds like it in BindingDB:
Activity Spreadsheet -- Enzyme Inhibition Constant Data from BindingDB
Found 3 hits for monomerid = 256867
TargetRAC-alpha serine/threonine-protein kinase(Homo sapiens (Human))
Astrazeneca
US Patent
LigandPNGBDBM256867(US10654855, Example 60 | US11236095, Example 60 | ...)
Affinity DataIC50:  23nMpH: 7.5 T: 2°C. Assay description: This assay detects inhibitors of AKT1 (PKBα) kinase activity using Caliper LabChip LC3000. The Caliper off-chip incubation mobility shift assay...
Ligand InfoPC cidPC sid
In DepthDetails US Patent
TargetRAC-alpha serine/threonine-protein kinase(Homo sapiens (Human))
Astrazeneca
US Patent
LigandPNGBDBM256867(US10654855, Example 60 | US11236095, Example 60 | ...)
Affinity DataIC50:  23nM. Assay description: Following addition of compound or control to the assay plate, 6p1 peptide mix containing 3 μM substrate (5-FAM-GRPRTSSFAEG-CONH2; CRB) and 40 &#...
Ligand InfoPC cidPC sid
In DepthDetails US Patent
TargetRAC-alpha serine/threonine-protein kinase(Homo sapiens (Human))
Astrazeneca
US Patent
LigandPNGBDBM256867(US10654855, Example 60 | US11236095, Example 60 | ...)
Affinity DataIC50:  23nM. Assay description: For Echo dosing the solvent was 100% DMSO. A master plate was prepared with 40 ul of 10 mM stock from our Primary Liquid Store in quadrant 1 of a Lab...
Ligand InfoPC cidPC sid
In DepthDetails US Patent