BDBM256961 US9493432, 87
SMILES Fc1ccc2nc(N[C@H]3CCC[C@@H]3NC(=O)c3ccccc3-n3nccn3)oc2c1
InChI Key InChIKey=DFTURMZSPIPCOT-HOTGVXAUSA-N
Data  2 IC50
  Tab Delimited (TSV)   2D SDfile   Computed 3D by Vconf -m prep SDfile
Find this compound or compounds like it in BindingDB:
Activity Spreadsheet -- Enzyme Inhibition Constant Data from BindingDB
Found 2 hits for monomerid = 256961
TargetOrexin receptor type 2(Homo sapiens (Human))
Takeda Pharmaceutical
US Patent
LigandPNGBDBM256961(US9493432, 87)
Affinity DataIC50: >1.00E+4nMT: 2°C. Assay description: Orexin antagonist activity was determined by measuring changes in intracellular calcium levels using a Ca2+ sensitive fluorescent dye. The changes in...
Ligand InfoPC cidPC sid
In DepthDetails US Patent
TargetOrexin/Hypocretin receptor type 1(Homo sapiens (Human))
Takeda Pharmaceutical
US Patent
LigandPNGBDBM256961(US9493432, 87)
Affinity DataIC50:  21nMT: 2°C. Assay description: Orexin antagonist activity was determined by measuring changes in intracellular calcium levels using a Ca2+ sensitive fluorescent dye. The changes in...
Ligand InfoPC cidPC sid
In DepthDetails US Patent