BDBM256962 US9493432, 88
SMILES Fc1ccc2oc(N[C@H]3CCC[C@@H]3NC(=O)c3ccccc3-n3nccn3)nc2c1
InChI Key InChIKey=JFPYMDXVSVUGTP-HOTGVXAUSA-N
Data  2 IC50
  Tab Delimited (TSV)   2D SDfile   Computed 3D by Vconf -m prep SDfile
Find this compound or compounds like it in BindingDB:
Activity Spreadsheet -- Enzyme Inhibition Constant Data from BindingDB
Found 2 hits for monomerid = 256962
TargetOrexin receptor type 2(Homo sapiens (Human))
Takeda Pharmaceutical
US Patent
LigandPNGBDBM256962(US9493432, 88)
Affinity DataIC50:  4.20E+3nMT: 2°C. Assay description: Orexin antagonist activity was determined by measuring changes in intracellular calcium levels using a Ca2+ sensitive fluorescent dye. The changes in...
Ligand InfoPC cidPC sid
In DepthDetails US Patent
TargetOrexin/Hypocretin receptor type 1(Homo sapiens (Human))
Takeda Pharmaceutical
US Patent
LigandPNGBDBM256962(US9493432, 88)
Affinity DataIC50:  21nMT: 2°C. Assay description: Orexin antagonist activity was determined by measuring changes in intracellular calcium levels using a Ca2+ sensitive fluorescent dye. The changes in...
Ligand InfoPC cidPC sid
In DepthDetails US Patent