BDBM256964 US9493432, 90
SMILES O=C(N[C@H]1CCC[C@@H]1Nc1nc2ccccc2s1)c1ccccc1-n1nccn1
InChI Key InChIKey=XAHDEDDXRWKNQO-HOTGVXAUSA-N
Data  2 IC50
  Tab Delimited (TSV)   2D SDfile   Computed 3D by Vconf -m prep SDfile
Find this compound or compounds like it in BindingDB:
Activity Spreadsheet -- Enzyme Inhibition Constant Data from BindingDB
Found 2 hits for monomerid = 256964
TargetOrexin receptor type 2(Homo sapiens (Human))
Takeda Pharmaceutical
US Patent
LigandPNGBDBM256964(US9493432, 90)
Affinity DataIC50: >1.00E+4nMT: 2°C. Assay description: Orexin antagonist activity was determined by measuring changes in intracellular calcium levels using a Ca2+ sensitive fluorescent dye. The changes in...
Ligand InfoPC cidPC sid
In DepthDetails US Patent
TargetOrexin/Hypocretin receptor type 1(Homo sapiens (Human))
Takeda Pharmaceutical
US Patent
LigandPNGBDBM256964(US9493432, 90)
Affinity DataIC50:  16nMT: 2°C. Assay description: Orexin antagonist activity was determined by measuring changes in intracellular calcium levels using a Ca2+ sensitive fluorescent dye. The changes in...
Ligand InfoPC cidPC sid
In DepthDetails US Patent