BDBM256982 US9493432, 104
SMILES Fc1ccc2nc(N[C@H]3CC(F)(F)C[C@H]3NC(=O)c3ccccc3-n3nccn3)sc2c1
InChI Key InChIKey=QTDPFBMGEYUINW-CVEARBPZSA-N
Data  2 IC50
  Tab Delimited (TSV)   2D SDfile   Computed 3D by Vconf -m prep SDfile
Find this compound or compounds like it in BindingDB:
Activity Spreadsheet -- Enzyme Inhibition Constant Data from BindingDB
Found 2 hits for monomerid = 256982
TargetOrexin receptor type 2(Homo sapiens (Human))
Takeda Pharmaceutical
US Patent
LigandPNGBDBM256982(US9493432, 104)
Affinity DataIC50:  4.50E+3nMT: 2°C. Assay description: Orexin antagonist activity was determined by measuring changes in intracellular calcium levels using a Ca2+ sensitive fluorescent dye. The changes in...
Ligand InfoPC cidPC sid
In DepthDetails US Patent
TargetOrexin/Hypocretin receptor type 1(Homo sapiens (Human))
Takeda Pharmaceutical
US Patent
LigandPNGBDBM256982(US9493432, 104)
Affinity DataIC50:  13nMT: 2°C. Assay description: Orexin antagonist activity was determined by measuring changes in intracellular calcium levels using a Ca2+ sensitive fluorescent dye. The changes in...
Ligand InfoPC cidPC sid
In DepthDetails US Patent