BDBM256986 US9493435, 3
SMILES Oc1ccc2cc(ccc2c1C=O)-c1ccc(cc1)C(=O)N1CCCC1
InChI Key InChIKey=CJWBMLGOPMYUFR-UHFFFAOYSA-N
Data  1 IC50
  Tab Delimited (TSV)   2D SDfile   Computed 3D by Vconf -m prep SDfile
Find this compound or compounds like it in BindingDB:
Activity Spreadsheet -- Enzyme Inhibition Constant Data from BindingDB
Found 1 hit for monomerid = 256986
LigandPNGBDBM256986(US9493435, 3)
Affinity DataIC50: <1.00E+3nMpH: 7.5 T: 2°C. Assay description: A fusion protein comprising glutathione S transferase (GST) and human IRE-1α (GST-IRE-1α) obtained from a 500 ml baculovirus-infected ins...
Ligand InfoPC cidPC sid
In DepthDetails US Patent