BDBM256990 US9493435, 7
SMILES CCN(CC)C(=O)c1cccc(n1)-c1ccc2c(C=O)c(O)ccc2c1
InChI Key InChIKey=MDYAZKNBNVDPRF-UHFFFAOYSA-N
Data  1 IC50
  Tab Delimited (TSV)   2D SDfile   Computed 3D by Vconf -m prep SDfile
Find this compound or compounds like it in BindingDB:
Activity Spreadsheet -- Enzyme Inhibition Constant Data from BindingDB
Found 1 hit for monomerid = 256990
LigandPNGBDBM256990(US9493435, 7)
Affinity DataIC50: <1.00E+3nMpH: 7.5 T: 2°C. Assay description: A fusion protein comprising glutathione S transferase (GST) and human IRE-1α (GST-IRE-1α) obtained from a 500 ml baculovirus-infected ins...
Ligand InfoPC cidPC sid
In DepthDetails US Patent