BDBM256993 BDBM257149::US9493435, 10
SMILES COCCNC(=O)c1ccc(cc1)-c1ccc2c(C=O)c(O)ccc2c1
InChI Key InChIKey=MNNDGTJUXPRGCA-UHFFFAOYSA-N
Data  2 IC50
  Tab Delimited (TSV)   2D SDfile   Computed 3D by Vconf -m prep SDfile
Find this compound or compounds like it in BindingDB:
Activity Spreadsheet -- Enzyme Inhibition Constant Data from BindingDB
Found 2 hits for monomerid = 256993
LigandPNGBDBM256993(BDBM257149 | US9493435, 10)
Affinity DataIC50: >1.00E+3nMpH: 7.5 T: 2°C. Assay description: A fusion protein comprising glutathione S transferase (GST) and human IRE-1α (GST-IRE-1α) obtained from a 500 ml baculovirus-infected ins...
Ligand InfoPC cidPC sid
In DepthDetails US Patent
LigandPNGBDBM256993(BDBM257149 | US9493435, 10)
Affinity DataIC50: <1.00E+3nMpH: 7.5 T: 2°C. Assay description: A fusion protein comprising glutathione S transferase (GST) and human IRE-1α (GST-IRE-1α) obtained from a 500 ml baculovirus-infected ins...
Ligand InfoPC cidPC sid
In DepthDetails US Patent