BDBM257000 US9493435, 17
SMILES COc1ccc(CNC(=O)c2cccc(n2)-c2ccc3c(C=O)c(O)ccc3c2)cc1
InChI Key InChIKey=RPRSIBFDAJAOQS-UHFFFAOYSA-N
Data  1 IC50
  Tab Delimited (TSV)   2D SDfile   Computed 3D by Vconf -m prep SDfile
Find this compound or compounds like it in BindingDB:
Activity Spreadsheet -- Enzyme Inhibition Constant Data from BindingDB
Found 1 hit for monomerid = 257000
LigandPNGBDBM257000(US9493435, 17)
Affinity DataIC50: <1.00E+3nMpH: 7.5 T: 2°C. Assay description: A fusion protein comprising glutathione S transferase (GST) and human IRE-1α (GST-IRE-1α) obtained from a 500 ml baculovirus-infected ins...
Ligand InfoPC cidPC sid
In DepthDetails US Patent