BDBM257055 US9493435, 73
SMILES Oc1ccc2cc(ccc2c1C=O)-c1ccc(s1)C(=O)NC1CCNC1
InChI Key InChIKey=QCYKMDJTXNBESB-UHFFFAOYSA-N
Data  1 IC50
  Tab Delimited (TSV)   2D SDfile   Computed 3D by Vconf -m prep SDfile
Find this compound or compounds like it in BindingDB:
Activity Spreadsheet -- Enzyme Inhibition Constant Data from BindingDB
Found 1 hit for monomerid = 257055
LigandPNGBDBM257055(US9493435, 73)
Affinity DataIC50: <100nMpH: 7.5 T: 2°C. Assay description: A fusion protein comprising glutathione S transferase (GST) and human IRE-1α (GST-IRE-1α) obtained from a 500 ml baculovirus-infected ins...
Ligand InfoPC cidPC sid
In DepthDetails US Patent