BDBM257070 US9493435, 88
SMILES Oc1ccc2ccc(cc2c1C=O)N1CCOCC1
InChI Key InChIKey=BJUOGKMTUOVCSQ-UHFFFAOYSA-N
Data  1 IC50
  Tab Delimited (TSV)   2D SDfile   Computed 3D by Vconf -m prep SDfile
Find this compound or compounds like it in BindingDB:
Activity Spreadsheet -- Enzyme Inhibition Constant Data from BindingDB
Found 1 hit for monomerid = 257070
LigandPNGBDBM257070(US9493435, 88)
Affinity DataIC50: >1.00E+3nMpH: 7.5 T: 2°C. Assay description: A fusion protein comprising glutathione S transferase (GST) and human IRE-1α (GST-IRE-1α) obtained from a 500 ml baculovirus-infected ins...
Ligand InfoPC cidPC sid
In DepthDetails US Patent