BDBM25780 1-(3-chlorophenyl)-4-{[4-(propan-2-yl)phenyl]carbonyl}piperazine::piperazine, a9
SMILES CC(C)c1ccc(cc1)C(=O)N1CCN(CC1)c1cccc(Cl)c1
InChI Key InChIKey=KDRDRJRTVGJLPF-UHFFFAOYSA-N
Data  1 IC50
  Tab Delimited (TSV)   2D SDfile   Computed 3D by Vconf -m prep SDfile
Find this compound or compounds like it in BindingDB:
Activity Spreadsheet -- Enzyme Inhibition Constant Data from BindingDB
Found 1 hit for monomerid = 25780
TargetEnoyl-[acyl-carrier-protein] reductase [NADH](Mycobacterium tuberculosis (strain ATCC 25618 / H3...)
Incyte
LigandPNGBDBM25780(1-(3-chlorophenyl)-4-{[4-(propan-2-yl)phenyl]carbo...)
Affinity DataIC50: >1.00E+5nMpH: 6.8 T: 2°C. Assay description: The assay measured the NADH-dependent catalysis of an octenoyl-CoA substrate as a decrease in 340 nm absorbance resulting from conversion of NADH to ...
In DepthDetails ArticlePubMed