BDBM25784 1-(3-chlorophenyl)-4-[(2-fluorophenyl)carbonyl]piperazine::piperazine, a13
SMILES Fc1ccccc1C(=O)N1CCN(CC1)c1cccc(Cl)c1
InChI Key InChIKey=DTDKTUPYLRGSMG-UHFFFAOYSA-N
Data  1 IC50
  Tab Delimited (TSV)   2D SDfile   Computed 3D by Vconf -m prep SDfile
Find this compound or compounds like it in BindingDB:
Activity Spreadsheet -- Enzyme Inhibition Constant Data from BindingDB
Found 1 hit for monomerid = 25784
TargetEnoyl-[acyl-carrier-protein] reductase [NADH](Mycobacterium tuberculosis (strain ATCC 25618 / H3...)
Incyte
LigandPNGBDBM25784(1-(3-chlorophenyl)-4-[(2-fluorophenyl)carbonyl]pip...)
Affinity DataIC50:  1.39E+4nMpH: 6.8 T: 2°C. Assay description: The assay measured the NADH-dependent catalysis of an octenoyl-CoA substrate as a decrease in 340 nm absorbance resulting from conversion of NADH to ...
In DepthDetails ArticlePubMed