BDBM257899 US9493446, 368
SMILES COc1cc(C(=O)N2CCC[C@H]2c2noc(n2)-c2cccc(F)c2OC)c(cc1Cl)-n1nccn1
InChI Key InChIKey=TVOPOIUNCIFOAI-KRWDZBQOSA-N
Data  2 IC50
  Tab Delimited (TSV)   2D SDfile   Computed 3D by Vconf -m prep SDfile
Find this compound or compounds like it in BindingDB:
Activity Spreadsheet -- Enzyme Inhibition Constant Data from BindingDB
Found 2 hits for monomerid = 257899
TargetOrexin receptor type 2(Homo sapiens (Human))
Actelion Pharmaceuticals
US Patent
LigandPNGBDBM257899(US9493446, 368)
Affinity DataIC50:  1nMT: 2°C. Assay description: Human orexin-A as an agonist is prepared as 1 mM stock solution in MeOH: water (1:1), diluted in HBSS containing 0.1% bovine serum albumin (BSA), NaH...
Ligand InfoPC cidPC sid
In DepthDetails US Patent
TargetOrexin/Hypocretin receptor type 1(Homo sapiens (Human))
Actelion Pharmaceuticals
US Patent
LigandPNGBDBM257899(US9493446, 368)
Affinity DataIC50:  11nMT: 2°C. Assay description: Human orexin-A as an agonist is prepared as 1 mM stock solution in MeOH: water (1:1), diluted in HBSS containing 0.1% bovine serum albumin (BSA), NaH...
Ligand InfoPC cidPC sid
In DepthDetails US Patent