BDBM258137 US9493448, 39::US9845313, Example 39
SMILES Fc1cc(c(F)cc1O[C@H]1CCCC[C@@H]1c1cccnc1)S(=O)(=O)Nc1ccncn1
InChI Key InChIKey=WSLJKXSTFOVFBC-QAPCUYQASA-N
Data  2 IC50
  Tab Delimited (TSV)   2D SDfile   Computed 3D by Vconf -m prep SDfile
Find this compound or compounds like it in BindingDB:
Activity Spreadsheet -- Enzyme Inhibition Constant Data from BindingDB
Found 2 hits for monomerid = 258137
TargetSodium channel protein type 9 subunit alpha(Homo sapiens (Human))
Daiichi Sankyo
US Patent
LigandPNGBDBM258137(US9493448, 39 | US9845313, Example 39)
Affinity DataIC50:  1.00E+3nM. Assay description: Current record was obtained by an automated patch clamp system “IonWorks Quattro (Molecular Devices Corporation)” in Population Patch Clamp mode. The...
Ligand InfoPC cidPC sid
In DepthDetails US Patent
TargetSodium channel protein type 9 subunit alpha(Homo sapiens (Human))
Daiichi Sankyo
US Patent
LigandPNGBDBM258137(US9493448, 39 | US9845313, Example 39)
Affinity DataIC50:  1.00E+3nMpH: 7.3 T: 2°C. Assay description: Current record was obtained by an automated patch clamp system IonWorks Quattro (Molecular Devices Corporation) in Population Patch Clamp mode. The o...
Ligand InfoPC cidPC sid
In DepthDetails US Patent