BDBM258142 US9493448, 44::US9845313, Example 44
SMILES Cn1nccc1[C@H]1CCCC[C@@H]1Oc1ccc(c(F)c1)S(=O)(=O)Nc1ccncn1
InChI Key InChIKey=LUCLPTILMXCCGT-QAPCUYQASA-N
Data  2 IC50
  Tab Delimited (TSV)   2D SDfile   Computed 3D by Vconf -m prep SDfile
Find this compound or compounds like it in BindingDB:
Activity Spreadsheet -- Enzyme Inhibition Constant Data from BindingDB
Found 2 hits for monomerid = 258142
TargetSodium channel protein type 9 subunit alpha(Homo sapiens (Human))
Daiichi Sankyo
US Patent
LigandPNGBDBM258142(US9493448, 44 | US9845313, Example 44)
Affinity DataIC50:  330nM. Assay description: Current record was obtained by an automated patch clamp system “IonWorks Quattro (Molecular Devices Corporation)” in Population Patch Clamp mode. The...
Ligand InfoPC cidPC sid
In DepthDetails US Patent
TargetSodium channel protein type 9 subunit alpha(Homo sapiens (Human))
Daiichi Sankyo
US Patent
LigandPNGBDBM258142(US9493448, 44 | US9845313, Example 44)
Affinity DataIC50:  330nMpH: 7.3 T: 2°C. Assay description: Current record was obtained by an automated patch clamp system IonWorks Quattro (Molecular Devices Corporation) in Population Patch Clamp mode. The o...
Ligand InfoPC cidPC sid
In DepthDetails US Patent