BDBM258189 US9493448, 171::US9493448, 94::US9597330, Example 60::US9845313, Example 171
SMILES Fc1cc(O[C@H]2CCCC[C@@H]2c2cn[nH]c2)cc(F)c1S(=O)(=O)Nc1ccncn1
InChI Key
Data  6 IC50
  Tab Delimited (TSV)   2D SDfile   Computed 3D by Vconf -m prep SDfile
Find this compound or compounds like it in BindingDB:
Activity Spreadsheet -- Enzyme Inhibition Constant Data from BindingDB
Found 6 hits for monomerid = 258189
TargetSodium channel protein type 9 subunit alpha(Homo sapiens (Human))
Daiichi Sankyo
US Patent
LigandPNGBDBM258189(US9493448, 171 | US9493448, 94 | US9597330, Exampl...)
Affinity DataIC50:  120nMpH: 7.3 T: 2°C. Assay description: Current record was obtained by an automated patch clamp system IonWorks Quattro (Molecular Devices Corporation) in Population Patch Clamp mode. The o...
Ligand InfoPC cidPC sid
In DepthDetails US Patent
TargetSodium channel protein type 9 subunit alpha(Homo sapiens (Human))
Daiichi Sankyo
US Patent
LigandPNGBDBM258189(US9493448, 171 | US9493448, 94 | US9597330, Exampl...)
Affinity DataIC50:  43nMpH: 7.3 T: 2°C. Assay description: Current record was obtained by an automated patch clamp system IonWorks Quattro (Molecular Devices Corporation) in Population Patch Clamp mode. The o...
Ligand InfoPC cidPC sid
In DepthDetails US Patent
TargetSodium channel protein type 9 subunit alpha(Homo sapiens (Human))
Daiichi Sankyo
US Patent
LigandPNGBDBM258189(US9493448, 171 | US9493448, 94 | US9597330, Exampl...)
Affinity DataIC50:  43nM. Assay description: Current record was obtained by an automated patch clamp system “IonWorks Quattro (Molecular Devices Corporation)” in Population Patch Clamp mode. The...
Ligand InfoPC cidPC sid
In DepthDetails US Patent
TargetSodium channel protein type 9 subunit alpha(Homo sapiens (Human))
Daiichi Sankyo
US Patent
LigandPNGBDBM258189(US9493448, 171 | US9493448, 94 | US9597330, Exampl...)
Affinity DataIC50:  43nM. Assay description: Current recording was obtained by an automated patch clamp system IonWorks Quattro (Molecular Devices Corporation) in Population Patch Clamp mode. Th...
Ligand InfoPC cidPC sid
In DepthDetails US Patent
TargetSodium channel protein type 9 subunit alpha(Homo sapiens (Human))
Daiichi Sankyo
US Patent
LigandPNGBDBM258189(US9493448, 171 | US9493448, 94 | US9597330, Exampl...)
Affinity DataIC50:  120nM. Assay description: Current record was obtained by an automated patch clamp system “IonWorks Quattro (Molecular Devices Corporation)” in Population Patch Clamp mode. The...
Ligand InfoPC cidPC sid
In DepthDetails US Patent
TargetSodium channel protein type 9 subunit alpha(Homo sapiens (Human))
Daiichi Sankyo
US Patent
LigandPNGBDBM258189(US9493448, 171 | US9493448, 94 | US9597330, Exampl...)
Affinity DataIC50:  120nM. Assay description: Current recording was obtained by an automated patch clamp system IonWorks Quattro (Molecular Devices Corporation) in Population Patch Clamp mode. Th...
Ligand InfoPC cidPC sid
In DepthDetails US Patent