BDBM258229 US9493448, 136::US9845313, Example 136
SMILES Cn1nccc1[C@H]1CC(F)(F)C[C@@H]1Oc1ccc(c(F)c1)S(=O)(=O)Nc1ccncn1
InChI Key InChIKey=PRRUSHUDYOOZGO-CJNGLKHVSA-N
Data  2 IC50
  Tab Delimited (TSV)   2D SDfile   Computed 3D by Vconf -m prep SDfile
Find this compound or compounds like it in BindingDB:
Activity Spreadsheet -- Enzyme Inhibition Constant Data from BindingDB
Found 2 hits for monomerid = 258229
TargetSodium channel protein type 9 subunit alpha(Homo sapiens (Human))
Daiichi Sankyo
US Patent
LigandPNGBDBM258229(US9493448, 136 | US9845313, Example 136)
Affinity DataIC50:  290nM. Assay description: Current record was obtained by an automated patch clamp system “IonWorks Quattro (Molecular Devices Corporation)” in Population Patch Clamp mode. The...
Ligand InfoPC cidPC sid
In DepthDetails US Patent
TargetSodium channel protein type 9 subunit alpha(Homo sapiens (Human))
Daiichi Sankyo
US Patent
LigandPNGBDBM258229(US9493448, 136 | US9845313, Example 136)
Affinity DataIC50:  290nMpH: 7.3 T: 2°C. Assay description: Current record was obtained by an automated patch clamp system IonWorks Quattro (Molecular Devices Corporation) in Population Patch Clamp mode. The o...
Ligand InfoPC cidPC sid
In DepthDetails US Patent