BDBM25831 4-[2-(3-hydroxyphenyl)-1,3-thiazol-5-yl]phenol::hydroxyphenyl substituted thiazole, 3
SMILES Oc1ccc(cc1)-c1cnc(s1)-c1cccc(O)c1
InChI Key InChIKey=WBUPCNHALRFMCB-UHFFFAOYSA-N
Data  4 IC50
  Tab Delimited (TSV)   2D SDfile   Computed 3D by Vconf -m prep SDfile
Find this compound or compounds like it in BindingDB:
Activity Spreadsheet -- Enzyme Inhibition Constant Data from BindingDB
Found 4 hits for monomerid = 25831
Target17-beta-hydroxysteroid dehydrogenase type 1(Homo sapiens (Human))
Saarland University
LigandPNGBDBM25831(4-[2-(3-hydroxyphenyl)-1,3-thiazol-5-yl]phenol | h...)
Affinity DataIC50:  50nMpH: 7.0 T: 2°C. Assay description: Tritiated E1 was incubated with 17beta-HSD1, cofactor, and inhibitor. The amount of labeled E2 formed was quantified by HPLC. Detection and quantific...
In DepthDetails ArticlePubMed
Target17-beta-hydroxysteroid dehydrogenase type 2(Homo sapiens (Human))
Saarland University
Curated by ChEMBL
LigandPNGBDBM25831(4-[2-(3-hydroxyphenyl)-1,3-thiazol-5-yl]phenol | h...)
Affinity DataIC50:  4.00E+3nM. Assay description: Inhibition of human placental 17betaHSD2 by radiodetection assay
In DepthDetails ArticlePubMed
Target17-beta-hydroxysteroid dehydrogenase type 1(Homo sapiens (Human))
Saarland University
LigandPNGBDBM25831(4-[2-(3-hydroxyphenyl)-1,3-thiazol-5-yl]phenol | h...)
Affinity DataIC50:  50nM. Assay description: Inhibition of human placental 17betaHSD1 by radiodetection assay
In DepthDetails ArticlePubMed
Target17-beta-hydroxysteroid dehydrogenase type 2(Homo sapiens (Human))
Saarland University
Curated by ChEMBL
LigandPNGBDBM25831(4-[2-(3-hydroxyphenyl)-1,3-thiazol-5-yl]phenol | h...)
Affinity DataIC50:  4.00E+3nM. Assay description: Tritiated E2 was incubated with 17beta-HSD2, cofactor, and inhibitor. The amount of labeled E1 formed was quantified by HPLC. Detection and quantific...
In DepthDetails ArticlePubMed