BDBM258361 US9505753, 30
SMILES Oc1nn(CCc2ccc(cc2)-c2ccccc2F)c(=O)[nH]c1=O
InChI Key InChIKey=OBBYYGRSTQOBEE-UHFFFAOYSA-N
Data  1 IC50
  Tab Delimited (TSV)   2D SDfile   Computed 3D by Vconf -m prep SDfile
Find this compound or compounds like it in BindingDB:
Activity Spreadsheet -- Enzyme Inhibition Constant Data from BindingDB
Found 1 hit for monomerid = 258361
TargetD-amino-acid oxidase(Homo sapiens (Human))
The Johns Hopkins University
US Patent
LigandPNGBDBM258361(US9505753, 30)
Affinity DataIC50:  80nMpH: 8.5 T: 2°C. Assay description: A reliable 96-well plate D-amino acid oxidase (DAAO) assay was developed based on previously published reports (J. Biol. Chem. 277: 27782 (2002)). Br...
Ligand InfoPC cidPC sid
In DepthDetails US Patent