BDBM258368 US9505786, 6
SMILES CC1(COCc2ccccc2)C(=O)Nc2nc(nnc12)-c1nn(Cc2ccccc2F)c2ncc(F)cc12
InChI Key InChIKey=MGPASUYXFXCANX-UHFFFAOYSA-N
Data  1 IC50
  Tab Delimited (TSV)   2D SDfile   Computed 3D by Vconf -m prep SDfile
Find this compound or compounds like it in BindingDB:
Activity Spreadsheet -- Enzyme Inhibition Constant Data from BindingDB
Found 1 hit for monomerid = 258368
TargetcGMP-specific 3',5'-cyclic phosphodiesterase(Homo sapiens (Human))
Bayer Pharma Aktiengesellschaft
US Patent
LigandPNGBDBM258368(US9505786, 6)
Affinity DataIC50:  1.10E+3nMpH: 7.5 T: 2°C. Assay description: To determine their in vitro action on human PDE 5, the test substances are dissolved in 100% DMSO and serially diluted. Typically, dilution series (1...
Ligand InfoPC cidPC sid
In DepthDetails US Patent