BDBM258457 US9512169, 11
SMILES CCC(Oc1ccc2[C@H]3CC[C@@]4(C)[C@@H](CC=C4c4cncc(F)c4)[C@@H]3CCc2c1)C(O)=O
InChI Key InChIKey=CDMXOOUFXXYFDF-FGADCVGASA-N
Data  1 IC50
  Tab Delimited (TSV)   2D SDfile   Computed 3D by Vconf -m prep SDfile
Find this compound or compounds like it in BindingDB:
Activity Spreadsheet -- Enzyme Inhibition Constant Data from BindingDB
Found 1 hit for monomerid = 258457
TargetAldo-keto reductase family 1 member C3/Glutathione S-transferase P(Homo sapiens (Human))
Bayer Pharma Aktiengesellschaft
US Patent
LigandPNGBDBM258457(US9512169, 11)
Affinity DataIC50:  2.5nMpH: 7.0 T: 2°C. Assay description: For the assay, 50 nl of a 100-fold concentrated solution of the test substance in DMSO were pipetted into a black low-volume 384-well microtiter plat...
Ligand InfoPC cidPC sid
In DepthDetails US Patent