BDBM258856 US9499492, 8
SMILES CCOC(=O)N=S(C)(=O)Cc1cccc(Nc2ncc(F)c(n2)-c2ccc(F)cc2F)c1
InChI Key InChIKey=GSYOSLIIPNEGLU-UHFFFAOYSA-N
Data  3 IC50
  Tab Delimited (TSV)   2D SDfile   Computed 3D by Vconf -m prep SDfile
Find this compound or compounds like it in BindingDB:
Activity Spreadsheet -- Enzyme Inhibition Constant Data from BindingDB
Found 3 hits for monomerid = 258856
TargetCyclin-T1/Cyclin-dependent kinase 9(Homo sapiens (Human))
Bayer Pharma Aktiengesellschaft
US Patent
LigandPNGBDBM258856(US9499492, 8)
Affinity DataIC50:  25nMpH: 8.0 T: 2°C. Assay description: Method 1a: Recombinant full-length His-tagged human CDK9 and CycT1, expressed in insect cells and purified by Ni-NTA affinity chromatography, were pu...
Ligand InfoPC cidPC sid
In DepthDetails US Patent
TargetCyclin-T1/Cyclin-dependent kinase 9(Homo sapiens (Human))
Bayer Pharma Aktiengesellschaft
US Patent
LigandPNGBDBM258856(US9499492, 8)
Affinity DataIC50:  1.50E+3nMpH: 8.0 T: 2°C. Assay description: Method 1b: Recombinant full-length His-tagged human CDK9 and CycT1, expressed in insect cells and purified by Ni-NTA affinity chromatography, were pu...
Ligand InfoPC cidPC sid
In DepthDetails US Patent
TargetCyclin-dependent kinase 2/G1/S-specific cyclin-E1/Glutathione S-transferase P(Homo sapiens (Human))
Bayer Pharma Aktiengesellschaft
US Patent
LigandPNGBDBM258856(US9499492, 8)
Affinity DataIC50:  560nMpH: 8.0 T: 2°C. Assay description: Method 2: Recombinant fusion proteins of GST and human CDK2 and of GST and human CycE, expressed in insect cells (Sf9) and purified by Glutathion-Sep...
Ligand InfoPC cidPC sid
In DepthDetails US Patent