BDBM259352 US9505745, 29::US9790212, Example 29
SMILES CCC(N1CCOCC1)c1scc(C(=O)NCc2c(C)cc(C)[nH]c2=O)c1C
InChI Key
Data  4 IC50
  Tab Delimited (TSV)   2D SDfile   Computed 3D by Vconf -m prep SDfile
Find this compound or compounds like it in BindingDB:
Activity Spreadsheet -- Enzyme Inhibition Constant Data from BindingDB
Found 4 hits for monomerid = 259352
LigandPNGBDBM259352(US9505745, 29 | US9790212, Example 29)
Affinity DataIC50:  398nM. Assay description: Protocol 1: Compounds contained herein were evaluated for their ability to inhibit the methyltransferase activity of EZH2 within the PRC2 complex. Hu...
Ligand InfoPC cidPC sid
In DepthDetails US Patent
LigandPNGBDBM259352(US9505745, 29 | US9790212, Example 29)
Affinity DataIC50:  3.16E+3nM. Assay description: Compounds contained herein were evaluated for their ability to inhibit the methyltransferase activity of EZH2 within the PRC2 complex. Human PRC2 com...
Ligand InfoPC cidPC sid
In DepthDetails US Patent
LigandPNGBDBM259352(US9505745, 29 | US9790212, Example 29)
Affinity DataIC50:  398nM. Assay description: Compounds contained herein were evaluated for their ability to inhibit the methyltransferase activity of EZH2 within the PRC2 complex. Human PRC2 com...
Ligand InfoPC cidPC sid
In DepthDetails US Patent
LigandPNGBDBM259352(US9505745, 29 | US9790212, Example 29)
Affinity DataIC50:  3.16E+3nM. Assay description: Protocol 2: Compounds contained herein were evaluated for their ability to inhibit the methyltransferase activity of EZH2 within the PRC2 complex. Hu...
Ligand InfoPC cidPC sid
In DepthDetails US Patent