BDBM259380 US9505745, 57::US9790212, Example 58
SMILES CCN(C1CCOCC1)c1sc(C2CCN(C2)C(=O)OC(C)(C)C)c(C(=O)NCc2c(C)cc(C)[nH]c2=O)c1C
InChI Key
Data  3 IC50
  Tab Delimited (TSV)   2D SDfile   Computed 3D by Vconf -m prep SDfile
Find this compound or compounds like it in BindingDB:
Activity Spreadsheet -- Enzyme Inhibition Constant Data from BindingDB
Found 3 hits for monomerid = 259380
LigandPNGBDBM259380(US9505745, 57 | US9790212, Example 58)
Affinity DataIC50:  200nM. Assay description: Protocol 2: Compounds contained herein were evaluated for their ability to inhibit the methyltransferase activity of EZH2 within the PRC2 complex. Hu...
Ligand InfoPC cidPC sid
In DepthDetails US Patent
LigandPNGBDBM259380(US9505745, 57 | US9790212, Example 58)
Affinity DataIC50:  794nM. Assay description: Compounds contained herein were evaluated for their ability to inhibit the methyltransferase activity of EZH2 within the PRC2 complex. Human PRC2 com...
Ligand InfoPC cidPC sid
In DepthDetails US Patent
LigandPNGBDBM259380(US9505745, 57 | US9790212, Example 58)
Affinity DataIC50:  200nM. Assay description: Compounds contained herein were evaluated for their ability to inhibit the methyltransferase activity of EZH2 within the PRC2 complex. Human PRC2 com...
Ligand InfoPC cidPC sid
In DepthDetails US Patent