BDBM259439 US10457647, Example 38::US11180460, Example 38::US11673868, Example 38::US9512084, 38
SMILES CO[C@H]1CCN([C@@H]1COc1c(N)ncnc1-c1cc(F)cc(NC(=O)c2ccc(cc2F)C2CC2)c1C)C(=O)C=C
InChI Key InChIKey=MRMUBBWFULSDKQ-RPBOFIJWSA-N
Data  4 IC50
  Tab Delimited (TSV)   2D SDfile   Computed 3D by Vconf -m prep SDfile
Find this compound or compounds like it in BindingDB:
Activity Spreadsheet -- Enzyme Inhibition Constant Data from BindingDB
Found 4 hits for monomerid = 259439
TargetTyrosine-protein kinase BTK(Homo sapiens (Human))
Novartis
US Patent
LigandPNGBDBM259439(US10457647, Example 38 | US11180460, Example 38 | ...)
Affinity DataIC50:  2nMpH: 7.5 T: 2°C. Assay description: The inhibitory activity of the present compounds against Btk was assessed in a biochemical enzyme assay. Assay plates in 384 well format were prepare...
Ligand InfoPC cidPC sid
In DepthDetails US Patent
TargetTyrosine-protein kinase BTK(Homo sapiens (Human))
Novartis
US Patent
LigandPNGBDBM259439(US10457647, Example 38 | US11180460, Example 38 | ...)
Affinity DataIC50:  2nM. Assay description: The inhibitory activity of the present compounds against Btk was assessed in a biochemical enzyme assay. Assay plates in 384 well format were prepare...
Ligand InfoPC cidPC sid
In DepthDetails US Patent
TargetTyrosine-protein kinase BTK(Homo sapiens (Human))
Novartis
US Patent
LigandPNGBDBM259439(US10457647, Example 38 | US11180460, Example 38 | ...)
Affinity DataIC50:  2nM. Assay description: The inhibitory activity of the present compounds against Btk was assessed in a biochemical enzyme assay. Assay plates in 384 well format were prepare...
Ligand InfoPC cidPC sid
In DepthDetails US Patent
TargetTyrosine-protein kinase BTK(Homo sapiens (Human))
Novartis
US Patent
LigandPNGBDBM259439(US10457647, Example 38 | US11180460, Example 38 | ...)
Affinity DataIC50:  2nM. Assay description: The inhibitory activity of the present compounds against Btk was assessed in a biochemical enzyme assay. Assay plates in 384 well format were prepare...
Ligand InfoPC cidPC sid
In DepthDetails US Patent