BDBM259480 US9512126, 21
SMILES Cc1cc(ccc1C(=O)NC1CC1)-c1cnc2c(NCCC(F)(F)F)cc(nn12)C(F)(F)c1cc(F)ccc1F
InChI Key InChIKey=XYWOGFYVZOWEAY-UHFFFAOYSA-N
Data  1 IC50
  Tab Delimited (TSV)   2D SDfile   Computed 3D by Vconf -m prep SDfile
Find this compound or compounds like it in BindingDB:
Activity Spreadsheet -- Enzyme Inhibition Constant Data from BindingDB
Found 1 hit for monomerid = 259480
TargetDual specificity protein kinase TTK/Glutathione S-transferase P(Homo sapiens (Human))
Bayer Intellectual Property
US Patent
LigandPNGBDBM259480(US9512126, 21)
Affinity DataIC50:  0.5nMpH: 7.7 T: 2°C. Assay description: The human kinase Mps-1 phosphorylates a biotinylated substrate peptide. Detection of the phosphorylated product is achieved by time-resolved fluoresc...
Ligand InfoPC cidPC sid
In DepthDetails US Patent