BDBM25983 D3RKN_86::N-(4-methoxyphenyl)-4-[2-methyl-5-(5-methyl-1,3,4-oxadiazol-2-yl)phenyl]benzamide::phenyl amide analog., 4
SMILES COc1ccc(NC(=O)c2ccc(cc2)-c2cc(ccc2C)-c2nnc(C)o2)cc1
InChI Key InChIKey=UHBZCEYZFPBQEU-UHFFFAOYSA-N
Data  1 KI  1 IC50  2 Kd
  Tab Delimited (TSV)   2D SDfile   Computed 3D by Vconf -m prep SDfile
Find this compound or compounds like it in BindingDB:
Activity Spreadsheet -- Enzyme Inhibition Constant Data from BindingDB
Found 3 hits for monomerid = 25983
TargetMitogen-activated protein kinase 14(Homo sapiens (Human))
Gsk
LigandPNGBDBM25983(D3RKN_86 | N-(4-methoxyphenyl)-4-[2-methyl-5-(5-me...)
Affinity DataKi:  360nM ΔG°:  -8.70kcal/mole IC50:  2.30E+3nMpH: 7.5 T: 2°C. Assay description: Fluorescence polarization assays used GST-tagged enzyme and an ATP-competitive Rhodamine-green labelled fluoroligand. These components were dissolved...
In DepthDetails ArticlePubMed
TargetTyrosine-protein kinase JAK2(Homo sapiens (Human))
D3R/Abbott
LigandPNGBDBM25983(D3RKN_86 | N-(4-methoxyphenyl)-4-[2-methyl-5-(5-me...)
Affinity DataKd:  1.00E+4nM. Assay description: D3R2022
In DepthDetails PubMed
TargetVascular endothelial growth factor receptor 2(Homo sapiens (Human))
D3R/Abbott
LigandPNGBDBM25983(D3RKN_86 | N-(4-methoxyphenyl)-4-[2-methyl-5-(5-me...)
Affinity DataKd:  1.00E+4nM. Assay description: D3R2021
In DepthDetails PubMed