BDBM259881 US10308662, Compound 122::US9505780, 122
SMILES CC(C)(C)c1cc(NC(=O)Nc2cccc(c2)-c2csc3c2oc(cc3=O)N2CCOCC2)no1
InChI Key InChIKey=UXPIXIQCBOEZLL-UHFFFAOYSA-N
Data  10 IC50
  Tab Delimited (TSV)   2D SDfile   Computed 3D by Vconf -m prep SDfile
Find this compound or compounds like it in BindingDB:
Activity Spreadsheet -- Enzyme Inhibition Constant Data from BindingDB
Found 10 hits for monomerid = 259881
TargetBromodomain-containing protein 4 [75-147](Homo sapiens (Human))
Signal Rx Pharmaceuticals
US Patent
LigandPNGBDBM259881(US10308662, Compound 122 | US9505780, 122)
Affinity DataIC50:  2.57E+3nM. Assay description: Several TP Scaffold compounds were tested for inhibition activity against isoforms of PI3K (alpha, beta, gamma, and delta isoforms) and the bromodoma...
Ligand InfoPC cidPC sid
In DepthDetails US Patent
TargetBromodomain-containing protein 4 [368-440](Homo sapiens (Human))
Signal Rx Pharmaceuticals
US Patent
LigandPNGBDBM259881(US10308662, Compound 122 | US9505780, 122)
Affinity DataIC50:  4.88E+3nM. Assay description: Several TP Scaffold compounds were tested for inhibition activity against isoforms of PI3K (alpha, beta, gamma, and delta isoforms) and the bromodoma...
Ligand InfoPC cidPC sid
In DepthDetails US Patent
TargetPhosphatidylinositol 4,5-bisphosphate 3-kinase catalytic subunit alpha isoform(Homo sapiens (Human))
Signal Rx Pharmaceuticals
US Patent
LigandPNGBDBM259881(US10308662, Compound 122 | US9505780, 122)
Affinity DataIC50:  950nM. Assay description: Several TP Scaffold compounds were tested for inhibition activity against isoforms of PI3K (alpha, beta, gamma, and delta isoforms) and the bromodoma...
Ligand InfoPC cidPC sid
In DepthDetails US Patent
TargetPhosphatidylinositol 4,5-bisphosphate 3-kinase catalytic subunit delta isoform(Homo sapiens (Human))
Signal Rx Pharmaceuticals
US Patent
LigandPNGBDBM259881(US10308662, Compound 122 | US9505780, 122)
Affinity DataIC50:  1.35E+3nM. Assay description: Several TP Scaffold compounds were tested for inhibition activity against isoforms of PI3K (alpha, beta, gamma, and delta isoforms) and the bromodoma...
Ligand InfoPC cidPC sid
In DepthDetails US Patent
TargetPhosphatidylinositol 4,5-bisphosphate 3-kinase catalytic subunit gamma isoform(Homo sapiens (Human))
Signal Rx Pharmaceuticals
US Patent
LigandPNGBDBM259881(US10308662, Compound 122 | US9505780, 122)
Affinity DataIC50:  8.65E+3nM. Assay description: Inhibitory activity can be determined routinely using known methods and also from commercial vendors offering this service for kinases and bromodomai...
Ligand InfoPC cidPC sid
In DepthDetails US Patent
TargetBromodomain-containing protein 4 [44-167](Homo sapiens (Human))
Signal Rx Pharmaceuticals
US Patent
LigandPNGBDBM259881(US10308662, Compound 122 | US9505780, 122)
Affinity DataIC50:  2.57E+3nM. Assay description: Inhibitory activity can be determined routinely using known methods and also from commercial vendors offering this service for kinases and bromodomai...
Ligand InfoPC cidPC sid
In DepthDetails US Patent
TargetBromodomain-containing protein 4 [349-460](Homo sapiens (Human))
Signal Rx Pharmaceuticals
US Patent
LigandPNGBDBM259881(US10308662, Compound 122 | US9505780, 122)
Affinity DataIC50:  4.88E+3nM. Assay description: Inhibitory activity can be determined routinely using known methods and also from commercial vendors offering this service for kinases and bromodomai...
Ligand InfoPC cidPC sid
In DepthDetails US Patent
TargetPhosphatidylinositol 3-kinase regulatory subunit alpha(Homo sapiens (Human))
Signal Rx Pharmaceuticals
US Patent
LigandPNGBDBM259881(US10308662, Compound 122 | US9505780, 122)
Affinity DataIC50:  950nM. Assay description: Inhibitory activity can be determined routinely using known methods and also from commercial vendors offering this service for kinases and bromodomai...
Ligand InfoPC cidPC sid
In DepthDetails US Patent
TargetPhosphatidylinositol 4,5-bisphosphate 3-kinase catalytic subunit delta isoform(Homo sapiens (Human))
Signal Rx Pharmaceuticals
US Patent
LigandPNGBDBM259881(US10308662, Compound 122 | US9505780, 122)
Affinity DataIC50:  1.35E+3nM. Assay description: Inhibitory activity can be determined routinely using known methods and also from commercial vendors offering this service for kinases and bromodomai...
Ligand InfoPC cidPC sid
In DepthDetails US Patent
TargetPhosphatidylinositol 4,5-bisphosphate 3-kinase catalytic subunit gamma isoform(Homo sapiens (Human))
Signal Rx Pharmaceuticals
US Patent
LigandPNGBDBM259881(US10308662, Compound 122 | US9505780, 122)
Affinity DataIC50:  8.65E+3nM. Assay description: Several TP Scaffold compounds were tested for inhibition activity against isoforms of PI3K (alpha, beta, gamma, and delta isoforms) and the bromodoma...
Ligand InfoPC cidPC sid
In DepthDetails US Patent