BDBM259912 US9512115, 16
SMILES FC(F)CCCOc1ccc(cc1)[C@H]1COC(=O)N1c1ccc2[nH]cnc2c1
InChI Key
Data  2 KI
  Tab Delimited (TSV)   2D SDfile   Computed 3D by Vconf -m prep SDfile
Find this compound or compounds like it in BindingDB:
Activity Spreadsheet -- Enzyme Inhibition Constant Data from BindingDB
Found 2 hits for monomerid = 259912
TargetGlutaminyl-peptide cyclotransferase(Homo sapiens (Human))
Probiodrug
US Patent
LigandPNGBDBM259912(US9512115, 16)
Affinity DataKi:  16.0nM ΔG°:  -10.8kcal/molepH: 6.0 T: 2°C. Assay description: All measurements were performed with a BioAssay Reader HTS-7000Plus for microplates (Perkin Elmer) at 30° C. QC activity was evaluated fluorometr...
Ligand InfoPC cidPC sid
In DepthDetails US Patent
TargetGlutaminyl-peptide cyclotransferase(Homo sapiens (Human))
Probiodrug
US Patent
LigandPNGBDBM259912(US9512115, 16)
Affinity DataKi:  22.1nM ΔG°:  -10.6kcal/molepH: 8.0 T: 2°C. Assay description: All measurements were performed with a BioAssay Reader HTS-7000Plus for microplates (Perkin Elmer) at 30° C. QC activity was evaluated fluorometr...
Ligand InfoPC cidPC sid
In DepthDetails US Patent