BDBM259940 US9512121, 24
SMILES Cn1cc(cn1)-c1cc(F)c2nnc(Sc3ccc4ncc5nc(sc5c4c3)C3CC3)n2c1
InChI Key InChIKey=DVSUFJNSCYKFHP-UHFFFAOYSA-N
Data  1 IC50
  Tab Delimited (TSV)   2D SDfile   Computed 3D by Vconf -m prep SDfile
Find this compound or compounds like it in BindingDB:
Activity Spreadsheet -- Enzyme Inhibition Constant Data from BindingDB
Found 1 hit for monomerid = 259940
TargetHepatocyte growth factor receptor(Homo sapiens (Human))
Jiangsu Hansoh Pharmaceutical
US Patent
LigandPNGBDBM259940(US9512121, 24)
Affinity DataIC50:  15.3nMT: 2°C. Assay description: Experimental Purpose: The purpose is to study the effect of the compounds on c-MET tyrosine kinase activity at the molecular level. IC50 values were ...
Ligand InfoPC cidPC sid
In DepthDetails US Patent