BDBM259961 US9512121, 45
SMILES COc1c(cnc2ccc(Sc3nnc4ccc(cn34)-c3cnn(C)c3)cc12)-c1c(C)noc1C
InChI Key InChIKey=JZYSUIXYIOVEKE-UHFFFAOYSA-N
Data  1 IC50
  Tab Delimited (TSV)   2D SDfile   Computed 3D by Vconf -m prep SDfile
Find this compound or compounds like it in BindingDB:
Activity Spreadsheet -- Enzyme Inhibition Constant Data from BindingDB
Found 1 hit for monomerid = 259961
TargetHepatocyte growth factor receptor(Homo sapiens (Human))
Jiangsu Hansoh Pharmaceutical
US Patent
LigandPNGBDBM259961(US9512121, 45)
Affinity DataIC50:  211nMT: 2°C. Assay description: Experimental Purpose: The purpose is to study the effect of the compounds on c-MET tyrosine kinase activity at the molecular level. IC50 values were ...
Ligand InfoPC cidPC sid
In DepthDetails US Patent