BDBM260053 PTP Inhibitor XXXI, II-B08::US9522881, II-B08
SMILES Cn1c(c(C2=CN(CCC(=O)Nc3ccc(cc3)-c3ccccc3)NN2)c2cc(C(O)=O)c(O)cc12)-c1ccccc1
InChI Key InChIKey=CBIUZGMIWGUQJS-UHFFFAOYSA-N
Data  1 IC50
  Tab Delimited (TSV)   2D SDfile   Computed 3D by Vconf -m prep SDfile
Find this compound or compounds like it in BindingDB:
Activity Spreadsheet -- Enzyme Inhibition Constant Data from BindingDB
Found 1 hit for monomerid = 260053
TargetPhosphatidylinositol 3,4,5-trisphosphate 5-phosphatase 2(Homo sapiens (Human))
Indiana University Research And Technology
US Patent
LigandPNGBDBM260053(PTP Inhibitor XXXI, II-B08 | US9522881, II-B08)
Affinity DataIC50:  5.50E+3nMpH: 7.0Assay Description:The inhibition assays were performed at 25° C. in 50 mM 3,3-dimethylglutarate buffer, pH 7.0, containing 1 mM EDTA with an ionic strength of 0.15M ad...
Ligand InfoPC cidPC sid
In DepthDetails US Patent