BDBM26019 N-methyl-4-({2-[methyl(phenyl)amino]-1H-1,3-benzodiazol-5-yl}oxy)pyridine-2-carboxamide::arylaminobenzimidazole, 14
SMILES CNC(=O)c1cc(Oc2ccc3n(C)c(Nc4ccccc4)nc3c2)ccn1
InChI Key InChIKey=GLRHEOXLLKWUGI-UHFFFAOYSA-N
Data  2 IC50
  Tab Delimited (TSV)   2D SDfile   Computed 3D by Vconf -m prep SDfile
Find this compound or compounds like it in BindingDB:
Activity Spreadsheet -- Enzyme Inhibition Constant Data from BindingDB
Found 2 hits for monomerid = 26019
TargetSerine/threonine-protein kinase B-raf [V600E](Homo sapiens (Human))
Novartis
LigandPNGBDBM26019(N-methyl-4-({2-[methyl(phenyl)amino]-1H-1,3-benzod...)
Affinity DataIC50:  130nM. Assay description: To measure compound inhibitor effects on the ability of Raf enzymes to phosphorylate the Mek substrate, a capture ELISA utilizing streptavidin-coated...
In DepthDetails ArticlePubMed
TargetRAF proto-oncogene serine/threonine-protein kinase(Homo sapiens (Human))
Novartis
LigandPNGBDBM26019(N-methyl-4-({2-[methyl(phenyl)amino]-1H-1,3-benzod...)
Affinity DataIC50:  48nMpH: 7.8 T: 2°C. Assay description: To measure compound inhibitor effects on the ability of Raf enzymes to phosphorylate the Mek substrate, a capture ELISA utilizing streptavidin-coated...
In DepthDetails ArticlePubMed