BDBM260420 US9527838, 48
SMILES COC(=O)CCc1cnc(NC(=O)c2nc(Sc3nncn3C)ccc2Sc2ccc(cc2)C(F)(F)F)s1
InChI Key InChIKey=AXMNQSYJEVQDRN-UHFFFAOYSA-N
Data  1 EC50
  Tab Delimited (TSV)   2D SDfile   Computed 3D by Vconf -m prep SDfile
Find this compound or compounds like it in BindingDB:
Activity Spreadsheet -- Enzyme Inhibition Constant Data from BindingDB
Found 1 hit for monomerid = 260420
TargetHexokinase-4(Homo sapiens (Human))
Merck Sharp & Dohme
US Patent
LigandPNGBDBM260420(US9527838, 48)
Affinity DataEC50:  71.8nM. Assay description: Recombinant human liver glucokinase was expressed as a FLAG fusion protein in E. coli, and purified on ANTIFLAG M2 AFFINITY GEL (Sigma). The assay wa...
Ligand InfoPC cidPC sid
In DepthDetails US Patent