BDBM260471 US10428074, Example 36::US9527851, 36
SMILES COC(=O)N1CC[C@H]2CC(C[C@H]2C1)N(C)c1ncnc2[nH]ccc12
InChI Key
Data  4 IC50
  Tab Delimited (TSV)   2D SDfile   Computed 3D by Vconf -m prep SDfile
Find this compound or compounds like it in BindingDB:
Activity Spreadsheet -- Enzyme Inhibition Constant Data from BindingDB
Found 4 hits for monomerid = 260471
TargetTyrosine-protein kinase JAK1(Homo sapiens (Human))
Jiangsu Hengrui Medicine
US Patent
LigandPNGBDBM260471(US10428074, Example 36 | US9527851, 36)
Affinity DataIC50:  25nMpH: 7.3 T: 2°C. Assay description: In vitro kinase assays described below can be used to determine the activity of a test compound for inhibiting the activity of JAK1 kinase. The test ...
Ligand InfoPC cidPC sid
In DepthDetails US Patent
TargetTyrosine-protein kinase JAK2(Homo sapiens (Human))
Jiangsu Hengrui Medicine
US Patent
LigandPNGBDBM260471(US10428074, Example 36 | US9527851, 36)
Affinity DataIC50:  75nM. Assay description: JAK2: In vitro kinase assays described below can be used to determine the activity of a test compound for inhibiting the activity of JAK2 kinase. The...
Ligand InfoPC cidPC sid
In DepthDetails US Patent
TargetTyrosine-protein kinase JAK1(Homo sapiens (Human))
Jiangsu Hengrui Medicine
US Patent
LigandPNGBDBM260471(US10428074, Example 36 | US9527851, 36)
Affinity DataIC50:  25nM. Assay description: JAK1: In vitro kinase assays described below can be used to determine the activity of a test compound for inhibiting the activity of JAK1 kinase. The...
Ligand InfoPC cidPC sid
In DepthDetails US Patent
TargetTyrosine-protein kinase JAK2(Homo sapiens (Human))
Jiangsu Hengrui Medicine
US Patent
LigandPNGBDBM260471(US10428074, Example 36 | US9527851, 36)
Affinity DataIC50:  75nMpH: 7.3 T: 2°C. Assay description: In vitro kinase assays described below can be used to determine the activity of a test compound for inhibiting the activity of JAK2 kinase. The test ...
Ligand InfoPC cidPC sid
In DepthDetails US Patent