BDBM260557 US10300066, Compound 31::US9532990, 31
SMILES Nc1ncnc2n(CC3CCCN(C3)C(=O)C=C)nc(-c3ccc(Oc4c(F)c(F)cc(F)c4F)cc3F)c12
InChI Key InChIKey=YUUQGEBWSKBRDS-UHFFFAOYSA-N
Data  2 IC50
  Tab Delimited (TSV)   2D SDfile   Computed 3D by Vconf -m prep SDfile
Find this compound or compounds like it in BindingDB:
Activity Spreadsheet -- Enzyme Inhibition Constant Data from BindingDB
Found 2 hits for monomerid = 260557
TargetTyrosine-protein kinase BTK(Homo sapiens (Human))
Zhejiang Dtrm Biopharma
US Patent
LigandPNGBDBM260557(US10300066, Compound 31 | US9532990, 31)
Affinity DataIC50:  15nM. Assay description: The enzyme reaction mixture of BTK wild type standard HTRF assay contained 1 nM BTK wild type, 1 μM biotin-TK1 peptide, and 30 μM ATP in a ...
Ligand InfoPC cidPC sid
In DepthDetails US Patent
TargetTyrosine-protein kinase BTK(Homo sapiens (Human))
Zhejiang Dtrm Biopharma
US Patent
LigandPNGBDBM260557(US10300066, Compound 31 | US9532990, 31)
Affinity DataIC50:  15nMT: 2°C. Assay description: The enzyme reaction mixture of BTK wild type standard HTRF assay contained 1 nM BTK wild type, 1 μM biotin-TK1 peptide, and 30 μM ATP in a ...
Ligand InfoPC cidPC sid
In DepthDetails US Patent