BDBM260563 US10300066, Compound 37::US9532990, 37
SMILES Nc1ncnc2n(nc(-c3ccc(Oc4c(F)c(F)cc(F)c4F)cc3F)c12)[C@H]1CC[C@@H](C1)N1C(=O)C=CC1=O
InChI Key InChIKey=GMXPTKSPLNBWGA-RYUDHWBXSA-N
Data  2 IC50
  Tab Delimited (TSV)   2D SDfile   Computed 3D by Vconf -m prep SDfile
Find this compound or compounds like it in BindingDB:
Activity Spreadsheet -- Enzyme Inhibition Constant Data from BindingDB
Found 2 hits for monomerid = 260563
TargetTyrosine-protein kinase BTK(Homo sapiens (Human))
Zhejiang Dtrm Biopharma
US Patent
LigandPNGBDBM260563(US10300066, Compound 37 | US9532990, 37)
Affinity DataIC50:  99nM. Assay description: The enzyme reaction mixture of BTK wild type standard HTRF assay contained 1 nM BTK wild type, 1 μM biotin-TK1 peptide, and 30 μM ATP in a ...
Ligand InfoPC cidPC sid
In DepthDetails US Patent
TargetTyrosine-protein kinase BTK(Homo sapiens (Human))
Zhejiang Dtrm Biopharma
US Patent
LigandPNGBDBM260563(US10300066, Compound 37 | US9532990, 37)
Affinity DataIC50:  99nMT: 2°C. Assay description: The enzyme reaction mixture of BTK wild type standard HTRF assay contained 1 nM BTK wild type, 1 μM biotin-TK1 peptide, and 30 μM ATP in a ...
Ligand InfoPC cidPC sid
In DepthDetails US Patent