BDBM260577 US10300066, Compound 51::US9532990, 51
SMILES Nc1ncnc2n(CCN3C(=O)C=CC3=O)nc(-c3ccc(Oc4c(F)c(F)cc(F)c4F)cc3F)c12
InChI Key InChIKey=YJBJSZGKBJQTGC-UHFFFAOYSA-N
Data  2 IC50
  Tab Delimited (TSV)   2D SDfile   Computed 3D by Vconf -m prep SDfile
Find this compound or compounds like it in BindingDB:
Activity Spreadsheet -- Enzyme Inhibition Constant Data from BindingDB
Found 2 hits for monomerid = 260577
TargetTyrosine-protein kinase BTK(Homo sapiens (Human))
Zhejiang Dtrm Biopharma
US Patent
LigandPNGBDBM260577(US10300066, Compound 51 | US9532990, 51)
Affinity DataIC50:  527nM. Assay description: The enzyme reaction mixture of BTK wild type standard HTRF assay contained 1 nM BTK wild type, 1 μM biotin-TK1 peptide, and 30 μM ATP in a ...
Ligand InfoPC cidPC sid
In DepthDetails US Patent
TargetTyrosine-protein kinase BTK(Homo sapiens (Human))
Zhejiang Dtrm Biopharma
US Patent
LigandPNGBDBM260577(US10300066, Compound 51 | US9532990, 51)
Affinity DataIC50:  527nMT: 2°C. Assay description: The enzyme reaction mixture of BTK wild type standard HTRF assay contained 1 nM BTK wild type, 1 μM biotin-TK1 peptide, and 30 μM ATP in a ...
Ligand InfoPC cidPC sid
In DepthDetails US Patent