BDBM260589 US10300066, Compound 63::US9532990, 63
SMILES Nc1ncnc2n(nc(-c3ccc(Oc4c(F)c(F)cc(F)c4F)cc3F)c12)C1CCCN(C1)C(=O)C1CNC(=O)S1
InChI Key InChIKey=RUWINPDUVNIROF-UHFFFAOYSA-N
Data  2 IC50
  Tab Delimited (TSV)   2D SDfile   Computed 3D by Vconf -m prep SDfile
Find this compound or compounds like it in BindingDB:
Activity Spreadsheet -- Enzyme Inhibition Constant Data from BindingDB
Found 2 hits for monomerid = 260589
TargetTyrosine-protein kinase BTK(Homo sapiens (Human))
Zhejiang Dtrm Biopharma
US Patent
LigandPNGBDBM260589(US10300066, Compound 63 | US9532990, 63)
Affinity DataIC50:  454nM. Assay description: The enzyme reaction mixture of BTK wild type standard HTRF assay contained 1 nM BTK wild type, 1 μM biotin-TK1 peptide, and 30 μM ATP in a ...
Ligand InfoPC cidPC sid
In DepthDetails US Patent
TargetTyrosine-protein kinase BTK(Homo sapiens (Human))
Zhejiang Dtrm Biopharma
US Patent
LigandPNGBDBM260589(US10300066, Compound 63 | US9532990, 63)
Affinity DataIC50:  454nMT: 2°C. Assay description: The enzyme reaction mixture of BTK wild type standard HTRF assay contained 1 nM BTK wild type, 1 μM biotin-TK1 peptide, and 30 μM ATP in a ...
Ligand InfoPC cidPC sid
In DepthDetails US Patent