BDBM260708 US9533989, 18::US9533989, 41
SMILES COc1ccc(CCCn2ccc3c(Nc4nc(N[C@@H]5CCCC[C@@H]5N)ncc4C(N)=O)cccc23)cc1
InChI Key InChIKey=FFXRMKOLWOHYLF-UKILVPOCSA-N
Data  2 IC50
  Tab Delimited (TSV)   2D SDfile   Computed 3D by Vconf -m prep SDfile
Find this compound or compounds like it in BindingDB:
Activity Spreadsheet -- Enzyme Inhibition Constant Data from BindingDB
Found 2 hits for monomerid = 260708
TargetTyrosine-protein kinase SYK(Homo sapiens (Human))
Ziarco Pharma
US Patent
LigandPNGBDBM260708(US9533989, 18 | US9533989, 41)
Affinity DataIC50:  15.3nM. Assay description: The Promega ADP-Glo Kinase Assay is a luminescent ADP detection assay that provides a universal, homogeneous, high-throughput screening method to mea...
Ligand InfoPC cidPC sid
In DepthDetails US Patent
TargetTyrosine-protein kinase SYK(Homo sapiens (Human))
Ziarco Pharma
US Patent
LigandPNGBDBM260708(US9533989, 18 | US9533989, 41)
Affinity DataIC50:  5.49nM. Assay description: The Promega ADP-Glo Kinase Assay is a luminescent ADP detection assay that provides a universal, homogeneous, high-throughput screening method to mea...
Ligand InfoPC cidPC sid
In DepthDetails US Patent