BDBM260770 US9533989, 81
SMILES N[C@H]1CCCC[C@H]1Nc1ncc(C(N)=O)c(Nc2ccc3CCN(Cc3c2)C(=O)C2CC2)n1
InChI Key InChIKey=NYSUZPVEYOYCJZ-VQTJNVASSA-N
Data  1 IC50
  Tab Delimited (TSV)   2D SDfile   Computed 3D by Vconf -m prep SDfile
Find this compound or compounds like it in BindingDB:
Activity Spreadsheet -- Enzyme Inhibition Constant Data from BindingDB
Found 1 hit for monomerid = 260770
TargetTyrosine-protein kinase SYK(Homo sapiens (Human))
Ziarco Pharma
US Patent
LigandPNGBDBM260770(US9533989, 81)
Affinity DataIC50:  36.9nM. Assay description: The Promega ADP-Glo Kinase Assay is a luminescent ADP detection assay that provides a universal, homogeneous, high-throughput screening method to mea...
Ligand InfoPC cidPC sid
In DepthDetails US Patent