BDBM260773 US9533989, 84
SMILES COc1cccc(Cn2ccc3ccc(Nc4nc(N[C@@H]5CCCC[C@@H]5N)ncc4C(N)=O)cc23)c1
InChI Key InChIKey=FRBQIMRFDJIQMQ-XZOQPEGZSA-N
Data  1 IC50
  Tab Delimited (TSV)   2D SDfile   Computed 3D by Vconf -m prep SDfile
Find this compound or compounds like it in BindingDB:
Activity Spreadsheet -- Enzyme Inhibition Constant Data from BindingDB
Found 1 hit for monomerid = 260773
TargetTyrosine-protein kinase SYK(Homo sapiens (Human))
Ziarco Pharma
US Patent
LigandPNGBDBM260773(US9533989, 84)
Affinity DataIC50:  41.1nM. Assay description: The Promega ADP-Glo Kinase Assay is a luminescent ADP detection assay that provides a universal, homogeneous, high-throughput screening method to mea...
Ligand InfoPC cidPC sid
In DepthDetails US Patent