BDBM26079 2-(carbamoylamino)-5-{2-[5-(1-hydroxypropyl)thiophen-3-yl]ethynyl}thiophene-3-carboxamide::5-acetylenyl-3-thiophenecarboxamide, 1c
SMILES CCC(O)c1cc(cs1)C#Cc1cc(C(N)=O)c(NC(N)=O)s1
InChI Key InChIKey=YFEAUXQZZQNVTD-UHFFFAOYSA-N
Data  1 IC50
  Tab Delimited (TSV)   2D SDfile   Computed 3D by Vconf -m prep SDfile
Find this compound or compounds like it in BindingDB:
Activity Spreadsheet -- Enzyme Inhibition Constant Data from BindingDB
Found 1 hit for monomerid = 26079
LigandPNGBDBM26079(2-(carbamoylamino)-5-{2-[5-(1-hydroxypropyl)thioph...)
Affinity DataIC50:  465nMpH: 7.6 T: 2°C. Assay description: The inhibitory effect of test compounds on kinase activity was measured using a biotinylated I-Kappa-B-alpha peptide and increasing doses of inhibito...
In DepthDetails ArticlePubMed