BDBM260805 US9533989, 116
SMILES N[C@H]1CCCC[C@H]1Nc1ncc(C(N)=O)c(Nc2cccc(Sc3ccccc3)c2)n1
InChI Key InChIKey=CFZSWUUADFHPCT-VQTJNVASSA-N
Data  1 IC50
  Tab Delimited (TSV)   2D SDfile   Computed 3D by Vconf -m prep SDfile
Find this compound or compounds like it in BindingDB:
Activity Spreadsheet -- Enzyme Inhibition Constant Data from BindingDB
Found 1 hit for monomerid = 260805
TargetTyrosine-protein kinase SYK(Homo sapiens (Human))
Ziarco Pharma
US Patent
LigandPNGBDBM260805(US9533989, 116)
Affinity DataIC50:  215nM. Assay description: The Promega ADP-Glo Kinase Assay is a luminescent ADP detection assay that provides a universal, homogeneous, high-throughput screening method to mea...
Ligand InfoPC cidPC sid
In DepthDetails US Patent