BDBM26092 5-[2-(3-benzamidophenyl)ethynyl]-2-(carbamoylamino)thiophene-3-carboxamide::5-acetylenyl-3-thiophenecarboxamide, 1p
SMILES NC(=O)Nc1sc(cc1C(N)=O)C#Cc1cccc(NC(=O)c2ccccc2)c1
InChI Key InChIKey=UDGXCBYGXLLZNH-UHFFFAOYSA-N
Data  1 IC50
  Tab Delimited (TSV)   2D SDfile   Computed 3D by Vconf -m prep SDfile
Find this compound or compounds like it in BindingDB:
Activity Spreadsheet -- Enzyme Inhibition Constant Data from BindingDB
Found 1 hit for monomerid = 26092
LigandPNGBDBM26092(5-[2-(3-benzamidophenyl)ethynyl]-2-(carbamoylamino...)
Affinity DataIC50:  704nMpH: 7.6 T: 2°C. Assay description: The inhibitory effect of test compounds on kinase activity was measured using a biotinylated I-Kappa-B-alpha peptide and increasing doses of inhibito...
In DepthDetails ArticlePubMed