BDBM261102 US10092570, Example 125::US10376513, Example 125::US10646492, Example 125::US11433071, Example 125::US9707233, 125::US9730939, Example 125::[3-(3-{1-[4-Amino-3-(1-methyl-1H-pyrazol-4-yl)-1H-pyrazolo[3,4-d]pyrimidin-1-yl]ethyl}-5-chloro-2-methoxy-6-methylphenyl)azetidin-1-yl]acetonitrile bis(trifluoroacetate)
SMILES COc1c(cc(Cl)c(C)c1C1CN(CC#N)C1)C(C)n1nc(-c2cnn(C)c2)c2c(N)ncnc12
InChI Key InChIKey=OMWMDQLAODHBCM-UHFFFAOYSA-N
Data  6 IC50
  Tab Delimited (TSV)   2D SDfile   Computed 3D by Vconf -m prep SDfile
Find this compound or compounds like it in BindingDB:
Activity Spreadsheet -- Enzyme Inhibition Constant Data from BindingDB
Found 6 hits for monomerid = 261102
LigandPNGBDBM261102(US10092570, Example 125 | US10376513, Example 125 ...)
Affinity DataIC50: <10nMpH: 6.7 T: 2°C. Assay description: Lipid kinase substrate, phosphoinositol-4,5-bisphosphate (PIP2), are purchased from Echelon Biosciences (Salt Lake City, Utah). PI3K isoforms α,...
Ligand InfoPC cidPC sid
In DepthDetails US Patent
TargetPhosphatidylinositol 4,5-bisphosphate 3-kinase catalytic subunit delta isoform(Homo sapiens (Human))
Incyte Holdings
US Patent
LigandPNGBDBM261102(US10092570, Example 125 | US10376513, Example 125 ...)
Affinity DataIC50: <10nMpH: 6.7 T: 2°C. Assay description: [γ-33P]ATP (10 mCi/mL) was purchased from Perkin-Elmer (Waltham, Mass.). Lipid kinase substrate, D-myo-Phosphatidylinositol 4,5-bisphosphate (Pt...
Ligand InfoPC cidPC sid
In DepthDetails US Patent
TargetPhosphatidylinositol 4,5-bisphosphate 3-kinase catalytic subunit delta isoform(Homo sapiens (Human))
Incyte Holdings
US Patent
LigandPNGBDBM261102(US10092570, Example 125 | US10376513, Example 125 ...)
Affinity DataIC50: <10nM. Assay description: The kinase reaction was conducted in polystyrene 384-well matrix white plate from Thermo Fisher Scientific in a final volume of 25 μL. Inhibitor...
Ligand InfoPC cidPC sid
In DepthDetails US Patent
TargetPhosphatidylinositol 4,5-bisphosphate 3-kinase catalytic subunit delta isoform(Homo sapiens (Human))
Incyte Holdings
US Patent
LigandPNGBDBM261102(US10092570, Example 125 | US10376513, Example 125 ...)
Affinity DataIC50: <10nM. Assay description: [γ-33P]ATP (10 mCi/mL) was purchased from Perkin-Elmer (Waltham, Mass.). Lipid kinase substrate, D-myo-Phosphatidylinositol 4,5-bisphosphate (Pt...
Ligand InfoPC cidPC sid
In DepthDetails US Patent
TargetPhosphatidylinositol 4,5-bisphosphate 3-kinase catalytic subunit delta isoform(Homo sapiens (Human))
Incyte Holdings
US Patent
LigandPNGBDBM261102(US10092570, Example 125 | US10376513, Example 125 ...)
Affinity DataIC50: <10nM. Assay description: The kinase reaction was conducted in polystyrene 384-well matrix white plate from Thermo Fisher Scientific in a final volume of 25 uL. Inhibitors wer...
Ligand InfoPC cidPC sid
In DepthDetails US Patent
TargetPhosphatidylinositol 4,5-bisphosphate 3-kinase catalytic subunit delta isoform(Homo sapiens (Human))
Incyte Holdings
US Patent
LigandPNGBDBM261102(US10092570, Example 125 | US10376513, Example 125 ...)
Affinity DataIC50: <10nM. Assay description: [γ-33P]ATP (10 mCi/mL) was purchased from PerkinElmer (Waltham, Mass.). Lipid kinase substrate, D-myo-Phosphatidylinositol 4,5-bisphosphate (Ptd...
Ligand InfoPC cidPC sid
In DepthDetails US Patent