BDBM26111 N,5-dihydroxy-2-methoxybenzamide::aromatic hydroxamic acid, 5b
SMILES COc1ccc(O)cc1C(=O)NO
InChI Key InChIKey=VVLCYQFXGFTUDQ-UHFFFAOYSA-N
Data  1 IC50
  Tab Delimited (TSV)   2D SDfile   Computed 3D by Vconf -m prep SDfile
Find this compound or compounds like it in BindingDB:
Activity Spreadsheet -- Enzyme Inhibition Constant Data from BindingDB
Found 1 hit for monomerid = 26111
TargetLysine-specific demethylase 4E(Homo sapiens (Human))
University Of Oxford
LigandPNGBDBM26111(N,5-dihydroxy-2-methoxybenzamide | aromatic hydrox...)
Affinity DataIC50:  2.30E+5nMpH: 7.5 T: 2°C. Assay description: A coupled-assay for JMJD2E activity employing formaldehyde dehydrogenase (FDH) from Pseudomonas putida was developed. Formaldehyde release by demethy...
In DepthDetails ArticlePubMed