BDBM261129 2-[3-(3-{-1-[4-Amino-3-(difluoromethyl)-1H-pyrazolo[3,4-d]pyrimidin-1-yl]ethyl}-5-chloro-2-ethoxy-6-fluorophenyl)azetidin-1-yl]ethanol::US10092570, Example 152::US10376513, Example 152::US10646492, Example 152::US9707233, 152::US9730939, Example 152
SMILES CCOc1c(cc(Cl)c(F)c1C1CN(CCO)C1)C(C)n1nc(C(F)F)c2c(N)ncnc12
InChI Key InChIKey=QIUBAVSRQAJLHV-UHFFFAOYSA-N
Data  5 IC50
  Tab Delimited (TSV)   2D SDfile   Computed 3D by Vconf -m prep SDfile
Find this compound or compounds like it in BindingDB:
Activity Spreadsheet -- Enzyme Inhibition Constant Data from BindingDB
Found 5 hits for monomerid = 261129
LigandPNGBDBM261129(2-[3-(3-{-1-[4-Amino-3-(difluoromethyl)-1H-pyrazol...)
Affinity DataIC50: <10nMpH: 6.7 T: 2°C. Assay description: Lipid kinase substrate, phosphoinositol-4,5-bisphosphate (PIP2), are purchased from Echelon Biosciences (Salt Lake City, Utah). PI3K isoforms α,...
Ligand InfoPC cidPC sid
In DepthDetails US Patent
TargetPhosphatidylinositol 4,5-bisphosphate 3-kinase catalytic subunit delta isoform(Homo sapiens (Human))
Incyte Holdings
US Patent
LigandPNGBDBM261129(2-[3-(3-{-1-[4-Amino-3-(difluoromethyl)-1H-pyrazol...)
Affinity DataIC50: <10nMpH: 6.7 T: 2°C. Assay description: [γ-33P]ATP (10 mCi/mL) was purchased from Perkin-Elmer (Waltham, Mass.). Lipid kinase substrate, D-myo-Phosphatidylinositol 4,5-bisphosphate (Pt...
Ligand InfoPC cidPC sid
In DepthDetails US Patent
TargetPhosphatidylinositol 4,5-bisphosphate 3-kinase catalytic subunit delta isoform(Homo sapiens (Human))
Incyte Holdings
US Patent
LigandPNGBDBM261129(2-[3-(3-{-1-[4-Amino-3-(difluoromethyl)-1H-pyrazol...)
Affinity DataIC50: <10nM. Assay description: The kinase reaction was conducted in polystyrene 384-well matrix white plate from Thermo Fisher Scientific in a final volume of 25 uL. Inhibitors wer...
Ligand InfoPC cidPC sid
In DepthDetails US Patent
TargetPhosphatidylinositol 4,5-bisphosphate 3-kinase catalytic subunit delta isoform(Homo sapiens (Human))
Incyte Holdings
US Patent
LigandPNGBDBM261129(2-[3-(3-{-1-[4-Amino-3-(difluoromethyl)-1H-pyrazol...)
Affinity DataIC50: <10nM. Assay description: [γ-33P]ATP (10 mCi/mL) was purchased from Perkin-Elmer (Waltham, Mass.). Lipid kinase substrate, D-myo-Phosphatidylinositol 4,5-bisphosphate (Pt...
Ligand InfoPC cidPC sid
In DepthDetails US Patent
TargetPhosphatidylinositol 4,5-bisphosphate 3-kinase catalytic subunit delta isoform(Homo sapiens (Human))
Incyte Holdings
US Patent
LigandPNGBDBM261129(2-[3-(3-{-1-[4-Amino-3-(difluoromethyl)-1H-pyrazol...)
Affinity DataIC50: <10nM. Assay description: [γ-33P]ATP (10 mCi/mL) was purchased from PerkinElmer (Waltham, Mass.). Lipid kinase substrate, D-myo-Phosphatidylinositol 4,5-bisphosphate (Ptd...
Ligand InfoPC cidPC sid
In DepthDetails US Patent