BDBM261288 US9707233, 314 (2nd peak)
SMILES CCOc1c(cc(C)c(C#N)c1-c1ccc(nc1)C(=O)N(C)C)[C@@H](C)n1nc(C)c2c(N)ncnc12
InChI Key InChIKey=HJSUGXVDZRGDIL-MRXNPFEDSA-N
Data  1 IC50
  Tab Delimited (TSV)   2D SDfile   Computed 3D by Vconf -m prep SDfile
Find this compound or compounds like it in BindingDB:
Activity Spreadsheet -- Enzyme Inhibition Constant Data from BindingDB
Found 1 hit for monomerid = 261288
LigandPNGBDBM261288(US9707233, 314 (2nd peak))
Affinity DataIC50: <10nMpH: 6.7 T: 2°C. Assay description: Lipid kinase substrate, phosphoinositol-4,5-bisphosphate (PIP2), are purchased from Echelon Biosciences (Salt Lake City, Utah). PI3K isoforms α,...
Ligand InfoPC cidPC sid
In DepthDetails US Patent